Thursday, July 16, 2009

OpenIMSCore Installation on Ubuntu 9.04

Lets try and keep it as simple as possible.

Please follow the steps below to configure OpenIMSCore on localhost, later steps will be listed to switch between localhost and a specific IP address:


a. libxml2 (with development)
b. libmysql (with development)
c. bind9
d. bison
e. flex
f. mysql-server
g. ant
h. make
i. jdk1.5
j. gcc3/4

1. Go to / directory through command prompt and

mkdir opt
cd opt
mkdir OpenIMSCore
cd OpenIMSCore
mkdir ser_ims
mkdir FHoSS

2. Change the permissions for opt folder created:

chmod 777 -R /opt

3. Check out the code for OpenIMSCore

cd /opt/OpenIMSCore/

ser_ims: sudo svn checkout ser_ims

FHoSS: sudo

4. Configure ser_ims

cd ser_ims
sudo make install-libs all

5. Install FHoSS

cd FHoSS
ant compile deploy
cd ..

6. Mysql dumps

mysql -u root -p < style="font-family: monospace;">
mysql -u root -p < FHoSS/scripts/userdata.sql
mysql -u root -p < ser_ims/cfg/icscf.sql

7. Copy and dump the following

cp ser_ims/cfg/*.cfg .
cp ser_ims/cfg/*.xml .
cp ser_ims/cfg/*.sh .

8. Make following configuration changes:

8.1 Edit /etc/bind/named.conf by adding following zone in it:

zone "open-ims.test" {
type master;
file "/etc/bind/open-ims.dnszone";

8.2 Copy open-ims.dnszone file to /etc/bind/

sudo cp ser_ims/cfg/open-ims.dnszone etc/bind/

8.3 Edit /etc/resolv.conf

# Generated by NetworkManager
search open-ims.test
domain open-ims.test

8.4 Edit etc/hosts localhost raziya-laptop open-ims.test ims.test

# The following lines are desirable for IPv6 capable hosts
::1 localhost ip6-localhost ip6-loopback
fe00::0 ip6-localnet
ff00::0 ip6-mcastprefix
ff02::1 ip6-allnodes
ff02::2 ip6-allrouters
ff02::3 ip6-allhosts

8.5 Restart bind server:

sudo /etc/init.d/bind9 restart

9. Confirm your configuration changes by digging the domain:
dig open-ims.test (It must list in your answer sections)

10. Start all nodes and hss:

10.1 cd opt/OpenIMSCore
10.2 ./
10.3 ./
10.4 ./
10.5 cd FHoSS/deploy
10.6 sh

Thats about it.

Now switching from localhost to a specific IP edit all the undermentioned files, by replacing all to your specific IP say for eg:

1. edit /etc/resolv.conf

2. edit /etc/hosts

3. edit /etc/bind/open-ims.test

4. restart bind: sudo /edit/init.d/bind9 restart

5. check: dig open-ims.test

6. Change Nodes setting:

6.1 icscf.cfg & icscf.xml (opt/OpenIMSCore/)
6.2 pcscf.cfg & pcscf.xml
6.3 scscf.cfg & scscf.xml

7. Change FHoSS setting

7.1 DiameterPeerHSS.xml (FHoSS/deploy)
7.2 (FHoSS/deploy)

Please feel free to comment.


BHARATH said...

hello this is BHARATH and im pursuing MS in IIIT pune.i liked u r website itz very informatic could you please help me in installing the current project in installing IPTV in ubuntu. thnk u....

Robson said...

Hi Raziya,
Thanks for your comment.
Its a very good "how-to-guide" to start in Open IMSCore....

In fact, last week I made the same configuration and is running very well over Ubuntu 9.04...Now I'm exploring this fantastic possibilty...there a lot of things to check in "real implementations"...

As the same that you told in your profile description, I'd like a lot Mobicents and IMS and the techologies behind (SLEE, SIP, Diameter etc)....But I came from "Telecom World" (+ 20 years experience), this is a "new world" for me with many many possiblities...

I visited the HP from your is going? More products are comming?


June said...

hello this is june from korea, im a student. i got some problems when i installed the openimscore. the problem is from

Buliding classpath
Classpath is lib/xml, bla,bla 15: /bin/java: Permission denied

can u make this right? thank u...

raziyabhayani said...

YOu gotto run as a "root". Or change permission of that file using your root access.

Buntha said...
This comment has been removed by the author.
Buntha said...

Hello, this is Buntha, I am a student at IIT Delhi, India. I have a problem after installed OpenIMSCore. I cannot run the PCSCFs and hss, it give me error messages:

- For the [ (./ line 4: setkey: command not found
./ line 5: setkey: command not found
./ line 7: /opt/OpenIMSCore/ser_ims/ser: No such file or directory)]

- For (./ line6 /opt/OpenIMSCore/ser_ims/ser: No such file or directory)

- For (./ line4 /opt/OpenIMSCore/ser_ims/ser: No such file or directory)

- For hss ( 15: /bin/java: not found)

Pls help me out of these problem. Thank you

Buntha said...

PS: Sorry forgot to mentioned. I am using Ubuntu 9.10.

mohamed amine said...

hello Buntha, u must run p,i,s:cscf from /opt/OpenIMSCore/ directory and for the hss u must move to /opt/OpenIMSCore/FHSS/deploy/ directory good luck

kaca bening said...

hai raziya, hai all, how about if we want to use specific IPv6 address? have you try openimscore with specific IPv6 address? would you give me some guide about openimscore in ipv6? thanks..

vis said...

hi khaziana,
I am doing masters in sweden. i have studied you tutorila on how to install ims.It was very interesting.I have installed openimscore. when i run ./pcscf i got error as

parse error (95,17-18): Can't set module parameter
set_mod_param_regex: No module matching found

i would be thankful for those who help me. In advance thanks

vis said...


I have another problem about:::

in seperate 3 terminals i run ./,scscf,icscf.

from one client if i run a sipp command with the source and destination ip addresses. how can these 3 pcscf,scscf,icscf and hss will communicate. would you plz explain with example?

pradiptasani said...

hello all,
i have run IMS ipv6, while i run ./, i had some error. invalid character ':' in value part of property

i mean that java at fhoss doesnt know the character (:) for the ipv6 digit separator.
can u help me?
many thanks..

Marius said...


I have successfully compiled OpenIMS and configured it, but I get this error when trying to run

/opt/OpenIMSCore/ser_ims/ser: No such file or directory

The compilation and install of ser_ims (make install-libs all) run without errors. Should that file be generated?

@Buntha: Did you manage to solve your missing "ser" file problem?

Thank you.

Wirelessexpert said...

Hi guys... need help on compiling

I'm unsuccessful in compiling the ser_ims i get error.. let me knw if am missing any of the environments...
I have insalled all pre-requisites mentioned in the article.
find the snapshot of errors as below,
usr/include/bits/syslog.h:32: undefined reference to `log_facility' In function `yyparse':
/opt/OpenIMSCore/ser_ims/cfg.y:957: undefined reference to `debug'
/opt/OpenIMSCore/ser_ims/cfg.y:957: undefined reference to `dprint_crit'
/opt/OpenIMSCore/ser_ims/cfg.y:957: undefined reference to `dprint_crit'
/opt/OpenIMSCore/ser_ims/cfg.y:957: undefined reference to `log_stderr'
/opt/OpenIMSCore/ser_ims/cfg.y:957: undefined reference to `dprint_crit'
/opt/OpenIMSCore/ser_ims/cfg.y:957: undefined reference to `dprint'
/opt/OpenIMSCore/ser_ims/cfg.y:957: undefined reference to `dprint_crit'
/opt/OpenIMSCore/ser_ims/cfg.y:957: undefined reference to `dprint_crit'
/opt/OpenIMSCore/ser_ims/cfg.y:928: undefined reference to `debug'
/opt/OpenIMSCore/ser_ims/cfg.y:928: undefined reference to `dprint_crit'
/opt/OpenIMSCore/ser_ims/cfg.y:928: undefined reference to `dprint_crit'
/opt/OpenIMSCore/ser_ims/cfg.y:928: undefined reference to `log_stderr'
/opt/OpenIMSCore/ser_ims/cfg.y:928: undefined reference to `dprint_crit'
/opt/OpenIMSCore/ser_ims/cfg.y:928: undefined reference to `dprint'
/opt/OpenIMSCore/ser_ims/cfg.y:928: undefined reference to `dprint_crit'
/opt/OpenIMSCore/ser_ims/cfg.y:928: undefined reference to `dprint_crit' In function `syslog':
/usr/include/bits/syslog.h:32: undefined reference to `log_facility'
/usr/include/bits/syslog.h:32: undefined reference to `log_facility'

SOHAIB said...

very helpful, was stuck in my final year project, it helped me alot



voleti said...

Building Classpath
Classpath is lib/xml-apis.jar:lib/xercesImpl.jar:lib/xerces-2.4.0.jar:lib/xalan-2.4.0.jar:lib/tomcat-util.jar:lib/tomcat-http.jar:lib/tomcat-coyote.jar:lib/struts.jar:lib/servlets-default.jar:lib/servlet-api.jar:lib/naming-resources.jar:lib/naming-factory.jar:lib/mysql-connector-java-3.1.12-bin.jar:lib/mx4j-3.0.1.jar:lib/log4j.jar:lib/junitee.jar:lib/junit.jar:lib/jta.jar:lib/jsp-api.jar:lib/jmx.jar:lib/jdp.jar:lib/jasper-runtime.jar:lib/jasper-compiler.jar:lib/jasper-compiler-jdt.jar:lib/hibernate3.jar:lib/ehcache-1.1.jar:lib/dom4j-1.6.1.jar:lib/commons-validator.jar:lib/commons-modeler.jar:lib/commons-logging.jar:lib/commons-logging-1.0.4.jar:lib/commons-lang.jar:lib/commons-fileupload.jar:lib/commons-el.jar:lib/commons-digester.jar:lib/commons-collections-3.1.jar:lib/commons-beanutils.jar:lib/cglib-2.1.3.jar:lib/catalina.jar:lib/catalina-optional.jar:lib/c3p0-0.9.1.jar:lib/base64.jar:lib/asm.jar:lib/asm-attrs.jar:lib/antlr-2.7.6.jar:lib/ 15: /bin/java: not found

voleti said...

Building Classpath
Classpath is lib/*
FHoSS/deploy/ line 15: /bin/java: No such file or directory
please reply to the bug

Lavinia said...

Hi, Voleti.. Have you find a solution to the error you asked about: "FHoSS/deploy/ line 15: /bin/java: No such file or directory" ?
Because I have the same problem, and I don't have any idea why..

Sebastian Bas said...

Hi! Thank you for the tutorial, big help!

@voleti,@Lavinia: I had the same problem (/bin/java: not found) To solve the issue I had to change my JAVA_HOME variable from /usr/lib/jvm/java-6-sun to the actual folder containing the stuff:

export JAVA_HOME=/usr/lib/jvm/java-6-sun-

This solved the problem for me. If you don't have the exact same folder name, change it to your most similar one I guess. Hope it helps!

Sandro said...

has anyone solved the problem with "/opt/OpenIMSCore/ser_ims/ser" folder not found?

admire musimwa said...

Thank you very much, it was very helpful and clear

Blogs For You said...


I am getting an error after "sudo make install-libs all ".

I have installed all prerequisites as mentioned in

Can you please provide your suggestion regarding this.

Some lines of this error are below :
multipart_parse.h: At top level:
multipart_parse.h:1:6: error: expected '=', ',', ';', 'asm' or
'__attribute__' before '.' token
add_body.c:13:51: warning: data definition has no type or storage
class [enabled by default]
add_body.c:13:51: warning: type defaults to 'int' in declaration of
'cont_type_e' [-Wimplicit-int]
add_body.c:26:47: error: expected declaration specifiers or '...'
before 'cont_type_e'
add_body.c: In function 'add_body_part':
add_body.c:76:2: warning: statement with no effect [-Wunused-value]
add_body.c:76:14: error: expected ';' before 'cnt_type'
add_body.c:90:2: warning: implicit declaration of function
'parse_multipart_body' [-Wimplicit-function-declaration]
add_body.c:90:32: error: 'cnt_type' undeclared (first use in this function)
add_body.c:90:32: note: each undeclared identifier is reported only
once for each function it appears in
add_body.c:94:8: error: 'MULTI_CONT' undeclared (first use in this function)
add_body.c:96:8: error: 'NO_CONT' undeclared (first use in this function)
add_body.c:98:8: error: 'SINGLE_CONT' undeclared (first use in this function)
add_body.c: In function 'add_body_multi_content':
add_body.c: In function 'add_body_no_content':
add_body.c:229:2: warning: implicit declaration of function
'cscf_add_header' [-Wimplicit-function-declaration]
add_body.c: In function 'get_headers_single_body_part':
add_body.c:316:2: warning: implicit declaration of function
'cscf_get_content_type' [-Wimplicit-function-declaration]
add_body.c:316:15: error: incompatible types when assigning to type
'str' from type 'int'
make[1]: *** [add_body.o] Error 1
make[1]: Leaving directory `/opt/OpenIMSCore/ser_ims/modules/ecscf'
make: *** [modules] Error 1

Willi Tchatchouang said...

What do you want to say by
""6. Change Nodes setting:

6.1 icscf.cfg & icscf.xml (opt/OpenIMSCore/)
6.2 pcscf.cfg & pcscf.xml
6.3 scscf.cfg & scscf.xml""""

I try to install OpenIMs a got some proble such as

ERROR: load_module: could not open module : /opt/OpenIMSCore/ser_ims/modules/cdp/ undefined symbol: log_dp_config
0(22590) parse error (63,13-14): failed to load module
0(22590) set_mod_param_regex: No module matching found
0(22590) parse error (64,18-19): Can't set module parameter

this happen when I do ./ ./ ./

an you help me please

elmehdi birouk said...

i have some problem when i run failed to load_module : could not open module